BDBM243216 US9546173, cmpd 13::n-(3-chloro-5-fluorobenzyl)-5,5-dimethyl-2-((tetrahydro-2h-pyran-4-yl)amino)-5h-pyrrolo[3,4-d]pyrimidine-6(7h)-carboxamide
SMILES CC1(C)N(Cc2nc(NC3CCOCC3)ncc12)C(=O)NCc1cc(F)cc(Cl)c1
InChI Key InChIKey=DYBIDZYJEIBTBE-UHFFFAOYSA-N
Data  1 IC50
  Tab Delimited (TSV)   2D SDfile   Computed 3D by Vconf -m prep SDfile
Find this compound or compounds like it in BindingDB:
Activity Spreadsheet -- Enzyme Inhibition Constant Data from BindingDB
Found 1 hit for monomerid = 243216
TargetMitogen-activated protein kinase 1(Homo sapiens (Human))
Novartis
US Patent
LigandPNGBDBM243216(US9546173, cmpd 13 | n-(3-chloro-5-fluorobenzyl)-5...)
Affinity DataIC50:  8nMpH: 7.5Assay Description:Compound potency against activated ERK2 was determined using a kinase assay that measures ERK2-catalyzed phosphorylation of biotinylated ERKtide pept...
Ligand InfoPC cidPC sid
In DepthDetails US Patent